BDBM96177 MLS000691970::N'-[7-(3-chlorophenyl)[1,2,4]triazolo[1,5-a]pyrimidin-2-yl]-N,N-dimethyliminoformamide::N'-[7-(3-chlorophenyl)-[1,2,4]triazolo[1,5-a]pyrimidin-2-yl]-N,N-dimethyl-formamidine::N'-[7-(3-chlorophenyl)-[1,2,4]triazolo[1,5-a]pyrimidin-2-yl]-N,N-dimethyl-methanimidamide::N'-[7-(3-chlorophenyl)-[1,2,4]triazolo[1,5-a]pyrimidin-2-yl]-N,N-dimethylmethanimidamide::SMR000333998::cid_9581809
SMILES CN(C)\C=N\c1nc2nccc(-c3cccc(Cl)c3)n2n1
InChI Key InChIKey=PLWUUAKZHPPLRJ-RQZCQDPDSA-N
Data  1 IC50
  Tab Delimited (TSV)   2D SDfile   Computed 3D by Vconf -m prep SDfile
Find this compound or compounds like it in BindingDB:
Activity Spreadsheet -- Enzyme Inhibition Constant Data from BindingDB
Found 1 hit for monomerid = 96177
TargetFructose-bisphosphate aldolase(Mycobacterium tuberculosis (strain H37Rv))
The Scripps Research Institute Molecular Screening Center
Curated by PubChem BioAssay
LigandPNGBDBM96177(MLS000691970 | N'-[7-(3-chlorophenyl)[1,2,4]tr...)
Affinity DataIC50:  1.15E+3nM
In DepthDetails PCBioAssay