BDBM96184 MLS002402779::SMR001370548::[3-(2,3-dihydro-1,4-benzodioxin-6-yl)-1,2-diphenyl-5-indolyl]methanol::[3-(2,3-dihydro-1,4-benzodioxin-6-yl)-1,2-diphenyl-indol-5-yl]methanol::[3-(2,3-dihydro-1,4-benzodioxin-6-yl)-1,2-diphenylindol-5-yl]methanol::cid_44142269
SMILES OCc1ccc2n(c(c(-c3ccc4OCCOc4c3)c2c1)-c1ccccc1)-c1ccccc1
InChI Key InChIKey=WGJZVPWLMYEXKO-UHFFFAOYSA-N
Data  1 IC50
  Tab Delimited (TSV)   2D SDfile   Computed 3D by Vconf -m prep SDfile
Find this compound or compounds like it in BindingDB:
Activity Spreadsheet -- Enzyme Inhibition Constant Data from BindingDB
Found 1 hit for monomerid = 96184
TargetFructose-bisphosphate aldolase(Mycobacterium tuberculosis (strain H37Rv))
The Scripps Research Institute Molecular Screening Center
Curated by PubChem BioAssay
LigandPNGBDBM96184(MLS002402779 | SMR001370548 | [3-(2,3-dihydro-1,4-...)
Affinity DataIC50:  913nM
Ligand InfoPC cidPC sid
In DepthDetails PCBioAssay