BDBM96186 1-naphthyl-[[5-(4-nitrophenyl)-2-furyl]methylene]amine::MLS002535719::N-(1-naphthalenyl)-1-[5-(4-nitrophenyl)-2-furanyl]methanimine::N-naphthalen-1-yl-1-[5-(4-nitrophenyl)furan-2-yl]methanimine::Naphthalen-1-yl-[5-(4-nitro-phenyl)-furan-2-ylmethylene]-amine::SMR000116005::cid_825614
SMILES [O-][N+](=O)c1ccc(cc1)-c1ccc(\C=N\c2cccc3ccccc23)o1
InChI Key InChIKey=FRPJYXDTYRRNMG-HYARGMPZSA-N
Data  1 IC50
  Tab Delimited (TSV)   2D SDfile   Computed 3D by Vconf -m prep SDfile
Find this compound or compounds like it in BindingDB:
Activity Spreadsheet -- Enzyme Inhibition Constant Data from BindingDB
Found 1 hit for monomerid = 96186
TargetFructose-bisphosphate aldolase(Mycobacterium tuberculosis (strain H37Rv))
The Scripps Research Institute Molecular Screening Center
Curated by PubChem BioAssay
LigandPNGBDBM96186(1-naphthyl-[[5-(4-nitrophenyl)-2-furyl]methylene]a...)
Affinity DataIC50:  8.15E+3nM
Ligand InfoPC cidPC sid
In DepthDetails PCBioAssay