BDBM96210 2-(2-keto-3,4,7-trimethyl-chromen-5-yl)oxy-N-[2-(4-sulfamoylphenyl)ethyl]acetamide::MLS001158593::N-[2-(4-sulfamoylphenyl)ethyl]-2-(3,4,7-trimethyl-2-oxidanylidene-chromen-5-yl)oxy-ethanamide::N-[2-(4-sulfamoylphenyl)ethyl]-2-(3,4,7-trimethyl-2-oxochromen-5-yl)oxyacetamide::N-[2-(4-sulfamoylphenyl)ethyl]-2-[(3,4,7-trimethyl-2-oxo-1-benzopyran-5-yl)oxy]acetamide::SMR000651940::cid_4974750
SMILES Cc1cc(OCC(=O)NCCc2ccc(cc2)S(N)(=O)=O)c2c(C)c(C)c(=O)oc2c1
InChI Key InChIKey=PIQFIXNTFLLSLP-UHFFFAOYSA-N
Data  1 IC50
  Tab Delimited (TSV)   2D SDfile   Computed 3D by Vconf -m prep SDfile
Find this compound or compounds like it in BindingDB:
Activity Spreadsheet -- Enzyme Inhibition Constant Data from BindingDB
Found 1 hit for monomerid = 96210
TargetFructose-bisphosphate aldolase(Mycobacterium tuberculosis (strain H37Rv))
The Scripps Research Institute Molecular Screening Center
Curated by PubChem BioAssay
LigandPNGBDBM96210(2-(2-keto-3,4,7-trimethyl-chromen-5-yl)oxy-N-[2-(4...)
Affinity DataIC50:  1.10E+3nM
In DepthDetails PCBioAssay