BDBM96213 5-[(2-keto-4-propyl-chromen-7-yl)oxymethyl]-2-furoic acid::5-[(2-oxidanylidene-4-propyl-chromen-7-yl)oxymethyl]furan-2-carboxylic acid::5-[(2-oxo-4-propyl-1-benzopyran-7-yl)oxymethyl]-2-furancarboxylic acid::5-[(2-oxo-4-propylchromen-7-yl)oxymethyl]furan-2-carboxylic acid::MLS001173218::SMR000539066::cid_808017
SMILES CCCc1cc(=O)oc2cc(OCc3ccc(o3)C(O)=O)ccc12
InChI Key InChIKey=BWFBOGJOAIHDFG-UHFFFAOYSA-N
Data  1 IC50
  Tab Delimited (TSV)   2D SDfile   Computed 3D by Vconf -m prep SDfile
Find this compound or compounds like it in BindingDB:
Activity Spreadsheet -- Enzyme Inhibition Constant Data from BindingDB
Found 1 hit for monomerid = 96213
TargetFructose-bisphosphate aldolase(Mycobacterium tuberculosis (strain H37Rv))
The Scripps Research Institute Molecular Screening Center
Curated by PubChem BioAssay
LigandPNGBDBM96213(5-[(2-keto-4-propyl-chromen-7-yl)oxymethyl]-2-furo...)
Affinity DataIC50:  2.44E+3nM
In DepthDetails PCBioAssay