BDBM96252 MLS000391909::N-[2-[(2E)-2-[(5-nitro-2-furanyl)methylidene]hydrazinyl]-2-oxoethyl]benzamide::N-[2-[(2E)-2-[(5-nitrofuran-2-yl)methylidene]hydrazinyl]-2-oxidanylidene-ethyl]benzamide::N-[2-[(2E)-2-[(5-nitrofuran-2-yl)methylidene]hydrazinyl]-2-oxoethyl]benzamide::N-[2-keto-2-[(N'E)-N'-[(5-nitro-2-furyl)methylene]hydrazino]ethyl]benzamide::SMR000260942::cid_6893438
SMILES [O-][N+](=O)c1ccc(\C=N\NC(=O)CNC(=O)c2ccccc2)o1
InChI Key InChIKey=IWNVYFWAHAVSDC-LZYBPNLTSA-N
Data  1 IC50
  Tab Delimited (TSV)   2D SDfile   Computed 3D by Vconf -m prep SDfile
Find this compound or compounds like it in BindingDB:
Activity Spreadsheet -- Enzyme Inhibition Constant Data from BindingDB
Found 1 hit for monomerid = 96252
TargetRecBCD enzyme subunit RecD(Escherichia coli str. K-12 substr. MG1655)
The Scripps Research Institute Molecular Screening Center
Curated by PubChem BioAssay
LigandPNGBDBM96252(MLS000391909 | N-[2-[(2E)-2-[(5-nitro-2-furanyl)me...)
Affinity DataIC50: >3.95E+4nM
In DepthDetails PCBioAssay