BDBM96284 6-(5-nitro-2-furanyl)-2H-1,2,4-triazine-3,5-dione::6-(5-nitro-2-furyl)-2H-1,2,4-triazine-3,5-quinone::6-(5-nitrofuran-2-yl)-2H-1,2,4-triazine-3,5-dione::MLS002667578::SMR001557342::WLN: T6NMVMVJ F- BT5OJ ENW::cid_66122
SMILES [O-][N+](=O)c1ccc(o1)-c1n[nH]c(=O)[nH]c1=O
InChI Key InChIKey=OYQZCMCEAPUWHK-UHFFFAOYSA-N
Data  1 IC50
  Tab Delimited (TSV)   2D SDfile   Computed 3D by Vconf -m prep SDfile
Find this compound or compounds like it in BindingDB:
Activity Spreadsheet -- Enzyme Inhibition Constant Data from BindingDB
Found 1 hit for monomerid = 96284
TargetRecBCD enzyme subunit RecD(Escherichia coli str. K-12 substr. MG1655)
The Scripps Research Institute Molecular Screening Center
Curated by PubChem BioAssay
LigandPNGBDBM96284(6-(5-nitro-2-furanyl)-2H-1,2,4-triazine-3,5-dione ...)
Affinity DataIC50:  6.13E+4nM
Ligand InfoPC cidPC sid
In DepthDetails PCBioAssay