BDBM96293 1-methyl-6-nitro-4-quinolinone::1-methyl-6-nitro-4-quinolone::1-methyl-6-nitro-quinolin-4-one::1-methyl-6-nitroquinolin-4-one::MLS003115133::SMR001830716::cid_311899
SMILES Cn1ccc(=O)c2cc(ccc12)[N+]([O-])=O
InChI Key InChIKey=RTYZYMGYCRYVGF-UHFFFAOYSA-N
Data  1 IC50
  Tab Delimited (TSV)   2D SDfile   Computed 3D by Vconf -m prep SDfile
Find this compound or compounds like it in BindingDB:
Activity Spreadsheet -- Enzyme Inhibition Constant Data from BindingDB
Found 1 hit for monomerid = 96293
TargetRecBCD enzyme subunit RecD(Escherichia coli str. K-12 substr. MG1655)
The Scripps Research Institute Molecular Screening Center
Curated by PubChem BioAssay
LigandPNGBDBM96293(1-methyl-6-nitro-4-quinolinone | 1-methyl-6-nitro-...)
Affinity DataIC50:  8.57E+4nM
In DepthDetails PCBioAssay