BDBM96306 2',3'-DIDEOXY-5-FLUOROCYTIDINE::4-amino-5-fluoro-1-(5-methyloltetrahydrofuran-2-yl)pyrimidin-2-one::4-amino-5-fluoro-1-[5-(hydroxymethyl)-2-oxolanyl]-2-pyrimidinone::4-amino-5-fluoro-1-[5-(hydroxymethyl)oxolan-2-yl]pyrimidin-2-one::4-azanyl-5-fluoranyl-1-[5-(hydroxymethyl)oxolan-2-yl]pyrimidin-2-one::MLS003389356::SMR002049011::cid_355450
SMILES Nc1nc(=O)n(cc1F)C1CCC(CO)O1
InChI Key InChIKey=QBEIABZPRBJOFU-UHFFFAOYSA-N
Data  1 IC50
  Tab Delimited (TSV)   2D SDfile   Computed 3D by Vconf -m prep SDfile
Find this compound or compounds like it in BindingDB:
Activity Spreadsheet -- Enzyme Inhibition Constant Data from BindingDB
Found 1 hit for monomerid = 96306
TargetRecBCD enzyme subunit RecD(Escherichia coli str. K-12 substr. MG1655)
The Scripps Research Institute Molecular Screening Center
Curated by PubChem BioAssay
LigandPNGBDBM96306(2',3'-DIDEOXY-5-FLUOROCYTIDINE | 4-amino-5...)
Affinity DataIC50: >1.18E+5nM
In DepthDetails PCBioAssay