BDBM96307 2-[5-(2-Fluoro-phenyl)-tetrazol-2-yl]-N-[4-(4-methyl-piperidine-1-sulfonyl)-phenyl]-acetamide::2-[5-(2-fluorophenyl)-1,2,3,4-tetrazol-2-yl]-N-[4-(4-methylpiperidin-1-yl)sulfonylphenyl]ethanamide::2-[5-(2-fluorophenyl)-2-tetrazolyl]-N-[4-[(4-methyl-1-piperidinyl)sulfonyl]phenyl]acetamide::2-[5-(2-fluorophenyl)tetrazol-2-yl]-N-[4-(4-methylpiperidin-1-yl)sulfonylphenyl]acetamide::2-[5-(2-fluorophenyl)tetrazol-2-yl]-N-[4-(4-methylpiperidino)sulfonylphenyl]acetamide::MLS000068248::SMR000003124::cid_653978
SMILES CC1CCN(CC1)S(=O)(=O)c1ccc(NC(=O)Cn2nnc(n2)-c2ccccc2F)cc1
InChI Key InChIKey=JVDYQVDVPIQLTK-UHFFFAOYSA-N
Data  2 IC50
  Tab Delimited (TSV)   2D SDfile   Computed 3D by Vconf -m prep SDfile
Find this compound or compounds like it in BindingDB:
Activity Spreadsheet -- Enzyme Inhibition Constant Data from BindingDB
Found 2 hits for monomerid = 96307
TargetAlbumin(Bos taurus)
The Scripps Research Institute Molecular Screening Center
Curated by PubChem BioAssay
LigandPNGBDBM96307(2-[5-(2-Fluoro-phenyl)-tetrazol-2-yl]-N-[4-(4-meth...)
Affinity DataIC50: >9.41E+4nM
In DepthDetails PCBioAssay
TargetT cell receptor alpha variable 4(Homo sapiens (Human))
The Scripps Research Institute Molecular Screening Center
Curated by PubChem BioAssay
LigandPNGBDBM96307(2-[5-(2-Fluoro-phenyl)-tetrazol-2-yl]-N-[4-(4-meth...)
Affinity DataIC50:  2.87E+4nM
In DepthDetails PCBioAssay