BDBM96329 2-[3-(3-chloranyl-4-fluoranyl-phenyl)-4-oxidanylidene-quinazolin-2-yl]sulfanyl-N-(3-morpholin-4-ylsulfonylphenyl)ethanamide::2-[3-(3-chloro-4-fluorophenyl)-4-oxoquinazolin-2-yl]sulfanyl-N-(3-morpholin-4-ylsulfonylphenyl)acetamide::2-[[3-(3-chloro-4-fluoro-phenyl)-4-keto-quinazolin-2-yl]thio]-N-(3-morpholinosulfonylphenyl)acetamide::2-[[3-(3-chloro-4-fluorophenyl)-4-oxo-2-quinazolinyl]thio]-N-[3-(4-morpholinylsulfonyl)phenyl]acetamide::MLS000339538::SMR000244153::cid_3941746
SMILES Fc1ccc(cc1Cl)-n1c(SCC(=O)Nc2cccc(c2)S(=O)(=O)N2CCOCC2)nc2ccccc2c1=O
InChI Key InChIKey=NTBDELHVMRJAKO-UHFFFAOYSA-N
Data  2 IC50
  Tab Delimited (TSV)   2D SDfile   Computed 3D by Vconf -m prep SDfile
Find this compound or compounds like it in BindingDB:
Activity Spreadsheet -- Enzyme Inhibition Constant Data from BindingDB
Found 2 hits for monomerid = 96329
TargetAlbumin(Bos taurus)
The Scripps Research Institute Molecular Screening Center
Curated by PubChem BioAssay
LigandPNGBDBM96329(2-[3-(3-chloranyl-4-fluoranyl-phenyl)-4-oxidanylid...)
Affinity DataIC50: >9.42E+4nM
In DepthDetails PCBioAssay
TargetT cell receptor alpha variable 4(Homo sapiens (Human))
The Scripps Research Institute Molecular Screening Center
Curated by PubChem BioAssay
LigandPNGBDBM96329(2-[3-(3-chloranyl-4-fluoranyl-phenyl)-4-oxidanylid...)
Affinity DataIC50: >1.05E+4nM
In DepthDetails PCBioAssay