BDBM96521 MLS002252952::N-(4-fluorophenyl)-2-[2-[(Z)-(4-keto-2-thioxo-thiazolidin-5-ylidene)methyl]phenoxy]acetamide::N-(4-fluorophenyl)-2-[2-[(Z)-(4-oxidanylidene-2-sulfanylidene-1,3-thiazolidin-5-ylidene)methyl]phenoxy]ethanamide::N-(4-fluorophenyl)-2-[2-[(Z)-(4-oxo-2-sulfanylidene-1,3-thiazolidin-5-ylidene)methyl]phenoxy]acetamide::N-(4-fluorophenyl)-2-[2-[(Z)-(4-oxo-2-sulfanylidene-5-thiazolidinylidene)methyl]phenoxy]acetamide::SMR001315285::cid_7185334
SMILES Fc1ccc(NC(=O)COc2ccccc2C=C2SC(S)=NC2=O)cc1
InChI Key InChIKey=RFHXNJDXVWWFOJ-UHFFFAOYSA-N
Data  1 IC50
  Tab Delimited (TSV)   2D SDfile   Computed 3D by Vconf -m prep SDfile
Find this compound or compounds like it in BindingDB:
Activity Spreadsheet -- Enzyme Inhibition Constant Data from BindingDB
Found 1 hit for monomerid = 96521
TargetHuntingtin(Homo sapiens (Human))
The Scripps Research Institute Molecular Screening Center
Curated by PubChem BioAssay
LigandPNGBDBM96521(MLS002252952 | N-(4-fluorophenyl)-2-[2-[(Z)-(4-ket...)
Affinity DataIC50:  1.69E+3nM
Ligand InfoPC cidPC sid
In DepthDetails PCBioAssay