BDBM96536 MLS003121794::N-[3-(difluoromethoxy)phenyl]sulfonyl-2-[4-(2-naphthalenyloxymethyl)-1-triazolyl]acetamide::N-[3-(difluoromethoxy)phenyl]sulfonyl-2-[4-(2-naphthoxymethyl)triazol-1-yl]acetamide::N-[3-(difluoromethoxy)phenyl]sulfonyl-2-[4-(naphthalen-2-yloxymethyl)triazol-1-yl]acetamide::N-[3-[bis(fluoranyl)methoxy]phenyl]sulfonyl-2-[4-(naphthalen-2-yloxymethyl)-1,2,3-triazol-1-yl]ethanamide::SMR001285123::cid_49789120
SMILES FC(F)Oc1cccc(c1)S(=O)(=O)NC(=O)Cn1cc(COc2ccc3ccccc3c2)nn1
InChI Key InChIKey=LYHXPPQGYUSXKT-UHFFFAOYSA-N
Data  1 IC50
  Tab Delimited (TSV)   2D SDfile   Computed 3D by Vconf -m prep SDfile
Find this compound or compounds like it in BindingDB:
Activity Spreadsheet -- Enzyme Inhibition Constant Data from BindingDB
Found 1 hit for monomerid = 96536
TargetHuntingtin(Homo sapiens (Human))
The Scripps Research Institute Molecular Screening Center
Curated by PubChem BioAssay
LigandPNGBDBM96536(MLS003121794 | N-[3-(difluoromethoxy)phenyl]sulfon...)
Affinity DataIC50:  1.45E+3nM
Ligand InfoPC cidPC sid
In DepthDetails PCBioAssay