BDBM96553 3-(3-Phenyl-pyrrolidin-1-yl)-1-thiophen-2-yl-propan-1-one::3-(3-phenyl-1-pyrrolidinyl)-1-thiophen-2-yl-1-propanone;hydrochloride::3-(3-phenylpyrrolidin-1-yl)-1-thiophen-2-yl-propan-1-one;hydrochloride::3-(3-phenylpyrrolidin-1-yl)-1-thiophen-2-ylpropan-1-one;hydrochloride::3-(3-phenylpyrrolidino)-1-(2-thienyl)propan-1-one;hydrochloride::MLS000035953::SMR000011654::cid_2893244
SMILES O=C(CCN1CCC(C1)c1ccccc1)c1cccs1
InChI Key InChIKey=PNZHYJLPSXGIOW-UHFFFAOYSA-N
Data  2 IC50  2 EC50
  Tab Delimited (TSV)   2D SDfile   Computed 3D by Vconf -m prep SDfile
Find this compound or compounds like it in BindingDB:
Activity Spreadsheet -- Enzyme Inhibition Constant Data from BindingDB
Found 4 hits for monomerid = 96553
TargetGuanine nucleotide-binding protein subunit alpha-15(Homo sapiens (Human))
The Scripps Research Institute Molecular Screening Center
Curated by PubChem BioAssay
LigandPNGBDBM96553(3-(3-Phenyl-pyrrolidin-1-yl)-1-thiophen-2-yl-propa...)
Affinity DataEC50: >2.99E+4nM
In DepthDetails PCBioAssay
TargetGuanine nucleotide-binding protein subunit alpha-15(Homo sapiens (Human))
The Scripps Research Institute Molecular Screening Center
Curated by PubChem BioAssay
LigandPNGBDBM96553(3-(3-Phenyl-pyrrolidin-1-yl)-1-thiophen-2-yl-propa...)
Affinity DataIC50: >2.99E+4nM
In DepthDetails PCBioAssay
TargetTrace amine-associated receptor 1(Homo sapiens (Human))
The Scripps Research Institute Molecular Screening Center
Curated by PubChem BioAssay
LigandPNGBDBM96553(3-(3-Phenyl-pyrrolidin-1-yl)-1-thiophen-2-yl-propa...)
Affinity DataEC50:  157nM
In DepthDetails PCBioAssay
TargetTrace amine-associated receptor 1(Homo sapiens (Human))
The Scripps Research Institute Molecular Screening Center
Curated by PubChem BioAssay
LigandPNGBDBM96553(3-(3-Phenyl-pyrrolidin-1-yl)-1-thiophen-2-yl-propa...)
Affinity DataIC50:  1.49E+3nM
In DepthDetails PCBioAssay