BDBM96636 4-(5-Phenethyl-2-thioxo-[1,3,5]triazinan-1-yl)-benzoic acid ethyl ester::4-(5-phenethyl-2-thioxo-1,3,5-triazinan-1-yl)benzoic acid ethyl ester::4-[5-(2-phenylethyl)-2-sulfanylidene-1,3,5-triazinan-1-yl]benzoic acid ethyl ester::MLS000589773::SMR000219558::cid_980466::ethyl 4-[5-(2-phenylethyl)-2-sulfanylidene-1,3,5-triazinan-1-yl]benzoate
SMILES CCOC(=O)c1ccc(cc1)N1CN(CCc2ccccc2)CNC1=S
InChI Key InChIKey=BIHPEXBRJDRAAX-UHFFFAOYSA-N
Data  2 IC50  2 EC50
  Tab Delimited (TSV)   2D SDfile   Computed 3D by Vconf -m prep SDfile
Find this compound or compounds like it in BindingDB:
Activity Spreadsheet -- Enzyme Inhibition Constant Data from BindingDB
Found 4 hits for monomerid = 96636
TargetGuanine nucleotide-binding protein subunit alpha-15(Homo sapiens (Human))
The Scripps Research Institute Molecular Screening Center
Curated by PubChem BioAssay
LigandPNGBDBM96636(4-(5-Phenethyl-2-thioxo-[1,3,5]triazinan-1-yl)-ben...)
Affinity DataEC50: >2.99E+4nM
In DepthDetails PCBioAssay
TargetGuanine nucleotide-binding protein subunit alpha-15(Homo sapiens (Human))
The Scripps Research Institute Molecular Screening Center
Curated by PubChem BioAssay
LigandPNGBDBM96636(4-(5-Phenethyl-2-thioxo-[1,3,5]triazinan-1-yl)-ben...)
Affinity DataIC50: >2.99E+4nM
In DepthDetails PCBioAssay
TargetTrace amine-associated receptor 1(Homo sapiens (Human))
The Scripps Research Institute Molecular Screening Center
Curated by PubChem BioAssay
LigandPNGBDBM96636(4-(5-Phenethyl-2-thioxo-[1,3,5]triazinan-1-yl)-ben...)
Affinity DataEC50:  68.5nM
In DepthDetails PCBioAssay
TargetTrace amine-associated receptor 1(Homo sapiens (Human))
The Scripps Research Institute Molecular Screening Center
Curated by PubChem BioAssay
LigandPNGBDBM96636(4-(5-Phenethyl-2-thioxo-[1,3,5]triazinan-1-yl)-ben...)
Affinity DataIC50:  776nM
In DepthDetails PCBioAssay