BDBM96729 2-[5-[[anilino(oxo)methyl]amino]-1,3,4-thiadiazol-2-yl]-N-phenylacetamide::MLS000768103::N-Phenyl-2-[5-(3-phenyl-ureido)-[1,3,4]thiadiazol-2-yl]-acetamide::N-phenyl-2-[5-(phenylcarbamoylamino)-1,3,4-thiadiazol-2-yl]acetamide::N-phenyl-2-[5-(phenylcarbamoylamino)-1,3,4-thiadiazol-2-yl]ethanamide::SMR000431423::cid_1873525
SMILES O=C(Cc1nnc(NC(=O)Nc2ccccc2)s1)Nc1ccccc1
InChI Key InChIKey=SXTUXOGXWDDQNV-UHFFFAOYSA-N
Data  2 IC50  2 EC50
  Tab Delimited (TSV)   2D SDfile   Computed 3D by Vconf -m prep SDfile
Find this compound or compounds like it in BindingDB:
Activity Spreadsheet -- Enzyme Inhibition Constant Data from BindingDB
Found 4 hits for monomerid = 96729
TargetGuanine nucleotide-binding protein subunit alpha-15(Homo sapiens (Human))
The Scripps Research Institute Molecular Screening Center
Curated by PubChem BioAssay
LigandPNGBDBM96729(2-[5-[[anilino(oxo)methyl]amino]-1,3,4-thiadiazol-...)
Affinity DataEC50: >2.99E+4nM
In DepthDetails PCBioAssay
TargetGuanine nucleotide-binding protein subunit alpha-15(Homo sapiens (Human))
The Scripps Research Institute Molecular Screening Center
Curated by PubChem BioAssay
LigandPNGBDBM96729(2-[5-[[anilino(oxo)methyl]amino]-1,3,4-thiadiazol-...)
Affinity DataIC50: >2.99E+4nM
In DepthDetails PCBioAssay
TargetTrace amine-associated receptor 1(Homo sapiens (Human))
The Scripps Research Institute Molecular Screening Center
Curated by PubChem BioAssay
LigandPNGBDBM96729(2-[5-[[anilino(oxo)methyl]amino]-1,3,4-thiadiazol-...)
Affinity DataEC50: >1.5nM
In DepthDetails PCBioAssay
TargetTrace amine-associated receptor 1(Homo sapiens (Human))
The Scripps Research Institute Molecular Screening Center
Curated by PubChem BioAssay
LigandPNGBDBM96729(2-[5-[[anilino(oxo)methyl]amino]-1,3,4-thiadiazol-...)
Affinity DataIC50: >1.11E+3nM
In DepthDetails PCBioAssay