BDBM96804 2-(2-fluorophenyl)acetic acid [2-keto-2-(phenethylamino)ethyl] ester::2-(2-fluorophenyl)acetic acid [2-oxo-2-(2-phenylethylamino)ethyl] ester::MLS002162935::SMR001245329::[2-oxidanylidene-2-(2-phenylethylamino)ethyl] 2-(2-fluorophenyl)ethanoate::[2-oxo-2-(2-phenylethylamino)ethyl] 2-(2-fluorophenyl)acetate::cid_8661334
SMILES Fc1ccccc1CC(=O)OCC(=O)NCCc1ccccc1
InChI Key InChIKey=FQNVTWRYHYWMBA-UHFFFAOYSA-N
Data  2 IC50  2 EC50
  Tab Delimited (TSV)   2D SDfile   Computed 3D by Vconf -m prep SDfile
Find this compound or compounds like it in BindingDB:
Activity Spreadsheet -- Enzyme Inhibition Constant Data from BindingDB
Found 4 hits for monomerid = 96804
TargetGuanine nucleotide-binding protein subunit alpha-15(Homo sapiens (Human))
The Scripps Research Institute Molecular Screening Center
Curated by PubChem BioAssay
LigandPNGBDBM96804(2-(2-fluorophenyl)acetic acid [2-keto-2-(phenethyl...)
Affinity DataEC50: >2.99E+4nM
In DepthDetails PCBioAssay
TargetGuanine nucleotide-binding protein subunit alpha-15(Homo sapiens (Human))
The Scripps Research Institute Molecular Screening Center
Curated by PubChem BioAssay
LigandPNGBDBM96804(2-(2-fluorophenyl)acetic acid [2-keto-2-(phenethyl...)
Affinity DataIC50: >2.99E+4nM
In DepthDetails PCBioAssay
TargetTrace amine-associated receptor 1(Homo sapiens (Human))
The Scripps Research Institute Molecular Screening Center
Curated by PubChem BioAssay
LigandPNGBDBM96804(2-(2-fluorophenyl)acetic acid [2-keto-2-(phenethyl...)
Affinity DataEC50: >9.96E+3nM
In DepthDetails PCBioAssay
TargetTrace amine-associated receptor 1(Homo sapiens (Human))
The Scripps Research Institute Molecular Screening Center
Curated by PubChem BioAssay
LigandPNGBDBM96804(2-(2-fluorophenyl)acetic acid [2-keto-2-(phenethyl...)
Affinity DataIC50:  2.35E+3nM
In DepthDetails PCBioAssay