BDBM96848 5-butyl-1-(3-fluorophenethyl)-4-(2-methoxyphenyl)-1H-imidazole::5-butyl-1-[2-(3-fluorophenyl)ethyl]-4-(2-methoxyphenyl)imidazole;2,2,2-trifluoroacetic acid::5-butyl-1-[2-(3-fluorophenyl)ethyl]-4-(2-methoxyphenyl)imidazole;2,2,2-tris(fluoranyl)ethanoic acid::MLS003509126::SMR002157300::cid_53300726
SMILES CCCCc1c(ncn1CCc1cccc(F)c1)-c1ccccc1OC
InChI Key InChIKey=CQMJBJHECXVYJW-UHFFFAOYSA-N
Data  2 IC50  2 EC50
  Tab Delimited (TSV)   2D SDfile   Computed 3D by Vconf -m prep SDfile
Find this compound or compounds like it in BindingDB:
Activity Spreadsheet -- Enzyme Inhibition Constant Data from BindingDB
Found 4 hits for monomerid = 96848
TargetGuanine nucleotide-binding protein subunit alpha-15(Homo sapiens (Human))
The Scripps Research Institute Molecular Screening Center
Curated by PubChem BioAssay
LigandPNGBDBM96848(5-butyl-1-(3-fluorophenethyl)-4-(2-methoxyphenyl)-...)
Affinity DataEC50: >2.99E+4nM
In DepthDetails PCBioAssay
TargetGuanine nucleotide-binding protein subunit alpha-15(Homo sapiens (Human))
The Scripps Research Institute Molecular Screening Center
Curated by PubChem BioAssay
LigandPNGBDBM96848(5-butyl-1-(3-fluorophenethyl)-4-(2-methoxyphenyl)-...)
Affinity DataIC50:  1.53E+4nM
In DepthDetails PCBioAssay
TargetTrace amine-associated receptor 1(Homo sapiens (Human))
The Scripps Research Institute Molecular Screening Center
Curated by PubChem BioAssay
LigandPNGBDBM96848(5-butyl-1-(3-fluorophenethyl)-4-(2-methoxyphenyl)-...)
Affinity DataEC50:  2.73E+3nM
In DepthDetails PCBioAssay
TargetTrace amine-associated receptor 1(Homo sapiens (Human))
The Scripps Research Institute Molecular Screening Center
Curated by PubChem BioAssay
LigandPNGBDBM96848(5-butyl-1-(3-fluorophenethyl)-4-(2-methoxyphenyl)-...)
Affinity DataIC50:  4.33E+3nM
In DepthDetails PCBioAssay