BDBM96903 4-[(2-chloranylphenoxy)methyl]-N-[3,5-dimethyl-1-[[2,3,4,5,6-pentakis(fluoranyl)phenyl]methyl]pyrazol-4-yl]benzamide::4-[(2-chlorophenoxy)methyl]-N-[3,5-dimethyl-1-(2,3,4,5,6-pentafluorobenzyl)-1H-pyrazol-4-yl]benzamide::4-[(2-chlorophenoxy)methyl]-N-[3,5-dimethyl-1-(2,3,4,5,6-pentafluorobenzyl)pyrazol-4-yl]benzamide::4-[(2-chlorophenoxy)methyl]-N-[3,5-dimethyl-1-[(2,3,4,5,6-pentafluorophenyl)methyl]-4-pyrazolyl]benzamide::4-[(2-chlorophenoxy)methyl]-N-[3,5-dimethyl-1-[(2,3,4,5,6-pentafluorophenyl)methyl]pyrazol-4-yl]benzamide::MLS000545496::SMR000160229::cid_1767835
SMILES Cc1nn(Cc2c(F)c(F)c(F)c(F)c2F)c(C)c1NC(=O)c1ccc(COc2ccccc2Cl)cc1
InChI Key InChIKey=IXASRNWCNRRYJE-UHFFFAOYSA-N
Data  2 IC50  2 EC50
  Tab Delimited (TSV)   2D SDfile   Computed 3D by Vconf -m prep SDfile
Find this compound or compounds like it in BindingDB:
Activity Spreadsheet -- Enzyme Inhibition Constant Data from BindingDB
Found 4 hits for monomerid = 96903
TargetTrace amine-associated receptor 1(Homo sapiens (Human))
The Scripps Research Institute Molecular Screening Center
Curated by PubChem BioAssay
LigandPNGBDBM96903(4-[(2-chloranylphenoxy)methyl]-N-[3,5-dimethyl-1-[...)
Affinity DataEC50: >2.99E+4nM
In DepthDetails PCBioAssay
TargetTrace amine-associated receptor 1(Homo sapiens (Human))
The Scripps Research Institute Molecular Screening Center
Curated by PubChem BioAssay
LigandPNGBDBM96903(4-[(2-chloranylphenoxy)methyl]-N-[3,5-dimethyl-1-[...)
Affinity DataIC50:  277nM
In DepthDetails PCBioAssay
TargetGuanine nucleotide-binding protein subunit alpha-15(Homo sapiens (Human))
The Scripps Research Institute Molecular Screening Center
Curated by PubChem BioAssay
LigandPNGBDBM96903(4-[(2-chloranylphenoxy)methyl]-N-[3,5-dimethyl-1-[...)
Affinity DataEC50: >2.99E+4nM
In DepthDetails PCBioAssay
TargetGuanine nucleotide-binding protein subunit alpha-15(Homo sapiens (Human))
The Scripps Research Institute Molecular Screening Center
Curated by PubChem BioAssay
LigandPNGBDBM96903(4-[(2-chloranylphenoxy)methyl]-N-[3,5-dimethyl-1-[...)
Affinity DataIC50: >2.99E+4nM
In DepthDetails PCBioAssay