BDBM96960 2-(4-methoxy-6-methyl-2-quinazolinyl)guanidine::2-(4-methoxy-6-methyl-quinazolin-2-yl)guanidine::2-(4-methoxy-6-methylquinazolin-2-yl)guanidine::MLS000578788::N-(4-methoxy-6-methyl-2-quinazolinyl)guanidine::SMR000186577::cid_600062
SMILES [#6]-[#8]-c1nc(\[#7]=[#6](\[#7])-[#7])nc2ccc(-[#6])cc12
InChI Key InChIKey=IBZPHBHVVLWJMU-UHFFFAOYSA-N
Data  1 EC50
  Tab Delimited (TSV)   2D SDfile   Computed 3D by Vconf -m prep SDfile
Find this compound or compounds like it in BindingDB:
Activity Spreadsheet -- Enzyme Inhibition Constant Data from BindingDB
Found 1 hit for monomerid = 96960
TargetProbable global transcription activator SNF2L2(Homo sapiens (Human))
The Scripps Research Institute Molecular Screening Center
Curated by PubChem BioAssay
LigandPNGBDBM96960(2-(4-methoxy-6-methyl-2-quinazolinyl)guanidine | 2...)
Affinity DataEC50:  3.38E+3nM
In DepthDetails PCBioAssay