BDBM96996 2-(2-azanylidene-3-butyl-benzimidazol-1-yl)-1-(4-methoxyphenyl)ethanone;hydrobromide::2-(3-Butyl-2-imino-2,3-dihydro-benzoimidazol-1-yl)-1-(4-methoxy-phenyl)-ethanone::2-(3-butyl-2-imino-1-benzimidazolyl)-1-(4-methoxyphenyl)ethanone;hydrobromide::2-(3-butyl-2-imino-benzimidazol-1-yl)-1-(4-methoxyphenyl)ethanone;hydrobromide::2-(3-butyl-2-iminobenzimidazol-1-yl)-1-(4-methoxyphenyl)ethanone;hydrobromide::MLS001012181::SMR000425178::cid_16682692
SMILES CCCCn1c2ccccc2n(CC(=O)c2ccc(OC)cc2)c1=N
InChI Key InChIKey=CVMVJWKVDKEFOF-UHFFFAOYSA-N
Data  1 EC50
  Tab Delimited (TSV)   2D SDfile   Computed 3D by Vconf -m prep SDfile
Find this compound or compounds like it in BindingDB:
Activity Spreadsheet -- Enzyme Inhibition Constant Data from BindingDB
Found 1 hit for monomerid = 96996
TargetProbable global transcription activator SNF2L2(Homo sapiens (Human))
The Scripps Research Institute Molecular Screening Center
Curated by PubChem BioAssay
LigandPNGBDBM96996(2-(2-azanylidene-3-butyl-benzimidazol-1-yl)-1-(4-m...)
Affinity DataEC50:  9.11E+4nM
In DepthDetails PCBioAssay