BDBM97004 3-ethyl-4-methyl-7-(2-oxidanylidenecyclohexyl)oxy-chromen-2-one::3-ethyl-4-methyl-7-(2-oxocyclohexyl)oxy-1-benzopyran-2-one::3-ethyl-4-methyl-7-(2-oxocyclohexyl)oxychromen-2-one::3-ethyl-7-(2-ketocyclohexoxy)-4-methyl-coumarin::MLS001213450::SMR000540521::cid_3453546
SMILES CCc1c(C)c2ccc(OC3CCCCC3=O)cc2oc1=O
InChI Key InChIKey=IZNVGPOGWHWRJT-UHFFFAOYSA-N
Data  1 EC50
  Tab Delimited (TSV)   2D SDfile   Computed 3D by Vconf -m prep SDfile
Find this compound or compounds like it in BindingDB:
Activity Spreadsheet -- Enzyme Inhibition Constant Data from BindingDB
Found 1 hit for monomerid = 97004
TargetProbable global transcription activator SNF2L2(Homo sapiens (Human))
The Scripps Research Institute Molecular Screening Center
Curated by PubChem BioAssay
LigandPNGBDBM97004(3-ethyl-4-methyl-7-(2-oxidanylidenecyclohexyl)oxy-...)
Affinity DataEC50:  9.12E+4nM
In DepthDetails PCBioAssay