BDBM97057 2-(6-Allylamino-purin-9-yl)-5-hydroxymethyl-tetrahydro-furan-3,4-diol::2-(hydroxymethyl)-5-[6-(prop-2-enylamino)-9-purinyl]oxolane-3,4-diol::2-(hydroxymethyl)-5-[6-(prop-2-enylamino)purin-9-yl]oxolane-3,4-diol::2-[6-(allylamino)purin-9-yl]-5-methylol-tetrahydrofuran-3,4-diol::MLS000068865::SMR000008702::cid_264006
SMILES OCC1OC(C(O)C1O)n1cnc2c(NCC=C)ncnc12
InChI Key InChIKey=WTYYPLSFICPDGL-UHFFFAOYSA-N
Data  1 IC50
  Tab Delimited (TSV)   2D SDfile   Computed 3D by Vconf -m prep SDfile
Find this compound or compounds like it in BindingDB:
Activity Spreadsheet -- Enzyme Inhibition Constant Data from BindingDB
Found 1 hit for monomerid = 97057
TargetGalanin receptor type 3(Homo sapiens (Human))
The Scripps Research Institute Molecular Screening Center
Curated by PubChem BioAssay
LigandPNGBDBM97057(2-(6-Allylamino-purin-9-yl)-5-hydroxymethyl-tetrah...)
Affinity DataIC50: >369nM
In DepthDetails PCBioAssay