BDBM97069 MLS000549889::N-methyl-N-[(1,3,5-trimethyl-1H-pyrazol-4-yl)methyl]-2-naphthalenesulfonamide::N-methyl-N-[(1,3,5-trimethyl-4-pyrazolyl)methyl]-2-naphthalenesulfonamide::N-methyl-N-[(1,3,5-trimethylpyrazol-4-yl)methyl]naphthalene-2-sulfonamide::SMR000113552::cid_842058
SMILES CN(Cc1c(C)nn(C)c1C)S(=O)(=O)c1ccc2ccccc2c1
InChI Key InChIKey=QQFAOBCJMZDGFZ-UHFFFAOYSA-N
Data  3 IC50
  Tab Delimited (TSV)   2D SDfile   Computed 3D by Vconf -m prep SDfile
Find this compound or compounds like it in BindingDB:
Activity Spreadsheet -- Enzyme Inhibition Constant Data from BindingDB
Found 3 hits for monomerid = 97069
TargetCOUP transcription factor 2(Homo sapiens (Human))
The Scripps Research Institute Molecular Screening Center
Curated by PubChem BioAssay
LigandPNGBDBM97069(MLS000549889 | N-methyl-N-[(1,3,5-trimethyl-1H-pyr...)
Affinity DataIC50:  3.25E+3nM
In DepthDetails PCBioAssay
TargetTegument protein VP16(Human herpesvirus 1 (strain 17) (HHV-1) (Human her...)
The Scripps Research Institute Molecular Screening Center
Curated by PubChem BioAssay
LigandPNGBDBM97069(MLS000549889 | N-methyl-N-[(1,3,5-trimethyl-1H-pyr...)
Affinity DataIC50:  8.54E+4nM. Assay description: Source (MLPCN Center Name): The Scripps Research Institute Molecular Screening Center Affiliation: The Scripps Research Institute, TSRI Assay Provide...
In DepthDetails PCBioAssay
TargetGalanin receptor type 3(Homo sapiens (Human))
The Scripps Research Institute Molecular Screening Center
Curated by PubChem BioAssay
LigandPNGBDBM97069(MLS000549889 | N-methyl-N-[(1,3,5-trimethyl-1H-pyr...)
Affinity DataIC50:  1.01E+3nM
In DepthDetails PCBioAssay