BDBM97156 1-(4-Chloro-benzyl)-2-methyl-1H-benzoimidazole::1-(4-chlorobenzyl)-2-methyl-benzimidazole::1-[(4-chlorophenyl)methyl]-2-methyl-benzimidazole::1-[(4-chlorophenyl)methyl]-2-methylbenzimidazole::MLS001240197::SMR000674565::cid_71821
SMILES Cc1nc2ccccc2n1Cc1ccc(Cl)cc1
InChI Key InChIKey=WNAQOLSMVPFGTE-UHFFFAOYSA-N
Data  3 IC50
  Tab Delimited (TSV)   2D SDfile   Computed 3D by Vconf -m prep SDfile
Find this compound or compounds like it in BindingDB:
Activity Spreadsheet -- Enzyme Inhibition Constant Data from BindingDB
Found 3 hits for monomerid = 97156
TargetCOUP transcription factor 2(Homo sapiens (Human))
The Scripps Research Institute Molecular Screening Center
Curated by PubChem BioAssay
LigandPNGBDBM97156(1-(4-Chloro-benzyl)-2-methyl-1H-benzoimidazole | 1...)
Affinity DataIC50:  1.06E+4nM
In DepthDetails PCBioAssay
TargetTegument protein VP16(Human herpesvirus 1 (strain 17) (HHV-1) (Human her...)
The Scripps Research Institute Molecular Screening Center
Curated by PubChem BioAssay
LigandPNGBDBM97156(1-(4-Chloro-benzyl)-2-methyl-1H-benzoimidazole | 1...)
Affinity DataIC50:  8.54E+4nM. Assay description: Source (MLPCN Center Name): The Scripps Research Institute Molecular Screening Center Affiliation: The Scripps Research Institute, TSRI Assay Provide...
In DepthDetails PCBioAssay
TargetGalanin receptor type 3(Homo sapiens (Human))
The Scripps Research Institute Molecular Screening Center
Curated by PubChem BioAssay
LigandPNGBDBM97156(1-(4-Chloro-benzyl)-2-methyl-1H-benzoimidazole | 1...)
Affinity DataIC50:  203nM
In DepthDetails PCBioAssay