BDBM97170 2-[6-(benzylamino)purin-9-yl]-1-[4-(2,4,6-trimethylbenzyl)piperazino]ethanone::2-[6-(benzylamino)purin-9-yl]-1-[4-[(2,4,6-trimethylphenyl)methyl]piperazin-1-yl]ethanone::2-[6-[(phenylmethyl)amino]-9-purinyl]-1-[4-[(2,4,6-trimethylphenyl)methyl]-1-piperazinyl]ethanone::2-[6-[(phenylmethyl)amino]purin-9-yl]-1-[4-[(2,4,6-trimethylphenyl)methyl]piperazin-1-yl]ethanone::MLS002632722::SMR001544327::cid_44601539
SMILES Cc1cc(C)c(CN2CCN(CC2)C(=O)Cn2cnc3c(NCc4ccccc4)ncnc23)c(C)c1
InChI Key InChIKey=PBJHRNPBEIJPHJ-UHFFFAOYSA-N
Data  3 IC50
  Tab Delimited (TSV)   2D SDfile   Computed 3D by Vconf -m prep SDfile
Find this compound or compounds like it in BindingDB:
Activity Spreadsheet -- Enzyme Inhibition Constant Data from BindingDB
Found 3 hits for monomerid = 97170
TargetCOUP transcription factor 2(Homo sapiens (Human))
The Scripps Research Institute Molecular Screening Center
Curated by PubChem BioAssay
LigandPNGBDBM97170(2-[6-(benzylamino)purin-9-yl]-1-[4-(2,4,6-trimethy...)
Affinity DataIC50:  2.71E+3nM
Ligand InfoPC cidPC sid
In DepthDetails PCBioAssay
TargetTegument protein VP16(Human herpesvirus 1 (strain 17) (HHV-1) (Human her...)
The Scripps Research Institute Molecular Screening Center
Curated by PubChem BioAssay
LigandPNGBDBM97170(2-[6-(benzylamino)purin-9-yl]-1-[4-(2,4,6-trimethy...)
Affinity DataIC50:  8.54E+4nM. Assay description: Source (MLPCN Center Name): The Scripps Research Institute Molecular Screening Center Affiliation: The Scripps Research Institute, TSRI Assay Provide...
Ligand InfoPC cidPC sid
In DepthDetails PCBioAssay
TargetGalanin receptor type 3(Homo sapiens (Human))
The Scripps Research Institute Molecular Screening Center
Curated by PubChem BioAssay
LigandPNGBDBM97170(2-[6-(benzylamino)purin-9-yl]-1-[4-(2,4,6-trimethy...)
Affinity DataIC50:  363nM
Ligand InfoPC cidPC sid
In DepthDetails PCBioAssay