BDBM97286 MLS001232823::N-[5-[2-(cyclopentylamino)-2-oxidanylidene-ethyl]sulfanyl-1,3,4-thiadiazol-2-yl]-2,4-dimethoxy-benzamide::N-[5-[2-(cyclopentylamino)-2-oxoethyl]sulfanyl-1,3,4-thiadiazol-2-yl]-2,4-dimethoxybenzamide::N-[5-[[2-(cyclopentylamino)-2-keto-ethyl]thio]-1,3,4-thiadiazol-2-yl]-2,4-dimethoxy-benzamide::N-[5-[[2-(cyclopentylamino)-2-oxoethyl]thio]-1,3,4-thiadiazol-2-yl]-2,4-dimethoxybenzamide::SMR000806363::cid_18561090
SMILES COc1ccc(C(=O)Nc2nnc(SCC(=O)NC3CCCC3)s2)c(OC)c1
InChI Key InChIKey=OSOWRYXRKAYCPT-UHFFFAOYSA-N
Data  2 IC50
  Tab Delimited (TSV)   2D SDfile   Computed 3D by Vconf -m prep SDfile
Find this compound or compounds like it in BindingDB:
Activity Spreadsheet -- Enzyme Inhibition Constant Data from BindingDB
Found 2 hits for monomerid = 97286
TargetSteroidogenic factor 1(Homo sapiens (Human))
The Scripps Research Institute Molecular Screening Center
Curated by PubChem BioAssay
LigandPNGBDBM97286(MLS001232823 | N-[5-[2-(cyclopentylamino)-2-oxidan...)
Affinity DataIC50: >6.75E+4nM
In DepthDetails PCBioAssay
TargetNuclear receptor subfamily 0 group B member 1(Homo sapiens (Human))
The Scripps Research Institute Molecular Screening Center
Curated by PubChem BioAssay
LigandPNGBDBM97286(MLS001232823 | N-[5-[2-(cyclopentylamino)-2-oxidan...)
Affinity DataIC50: >92.6nM
In DepthDetails PCBioAssay