BDBM97309 MLS002181975::N-(2,3-dihydro-1,4-benzodioxin-3-ylmethyl)-1-methyl-2-pyrrolecarboxamide::N-(2,3-dihydro-1,4-benzodioxin-3-ylmethyl)-1-methyl-pyrrole-2-carboxamide::N-(2,3-dihydro-1,4-benzodioxin-3-ylmethyl)-1-methylpyrrole-2-carboxamide::SMR001271005::cid_25161990
SMILES Cn1cccc1C(=O)NCC1COc2ccccc2O1
InChI Key InChIKey=SMOLSTVPMZMTSI-UHFFFAOYSA-N
Data  2 IC50
  Tab Delimited (TSV)   2D SDfile   Computed 3D by Vconf -m prep SDfile
Find this compound or compounds like it in BindingDB:
Activity Spreadsheet -- Enzyme Inhibition Constant Data from BindingDB
Found 2 hits for monomerid = 97309
TargetSteroidogenic factor 1(Homo sapiens (Human))
The Scripps Research Institute Molecular Screening Center
Curated by PubChem BioAssay
LigandPNGBDBM97309(MLS002181975 | N-(2,3-dihydro-1,4-benzodioxin-3-yl...)
Affinity DataIC50: >6.75E+4nM
In DepthDetails PCBioAssay
TargetNuclear receptor subfamily 0 group B member 1(Homo sapiens (Human))
The Scripps Research Institute Molecular Screening Center
Curated by PubChem BioAssay
LigandPNGBDBM97309(MLS002181975 | N-(2,3-dihydro-1,4-benzodioxin-3-yl...)
Affinity DataIC50: >6.75E+4nM
In DepthDetails PCBioAssay