BDBM97466 US8470800, C
SMILES O[C@@H]1[C@@H](COS(=O)(=O)O[Na])O[C@H]([C@@H]1O)n1cnc2c(NC3CCCC3)ncnc12
InChI Key InChIKey=SYHNGKRBPFJKCW-DNBRLMRSSA-M
Data  1 KI
  Tab Delimited (TSV)   2D SDfile   Computed 3D by Vconf -m prep SDfile
Find this compound or compounds like it in BindingDB:
Activity Spreadsheet -- Enzyme Inhibition Constant Data from BindingDB
Found 1 hit for monomerid = 97466
TargetAdenosine receptor A1(Homo sapiens (Human))
Inotek Pharmaceuticals
US Patent
LigandPNGBDBM97466(US8470800, C)
Affinity DataKi:  4.05nM ΔG°:  -10.6kcal/molepH: 7.4 T: 2°C. Assay description: Radioligand binding assay using adenosine receptor.
In DepthDetails US Patent