BDBM97598 US8470841, 10
SMILES CC(C)Oc1ccc(Oc2ccc(CCC(C)NC(C)=O)cc2)nc1
InChI Key InChIKey=NGIUAGMCGCGBQN-UHFFFAOYSA-N
Data  1 IC50
  Tab Delimited (TSV)   2D SDfile   Computed 3D by Vconf -m prep SDfile
Find this compound or compounds like it in BindingDB:
Activity Spreadsheet -- Enzyme Inhibition Constant Data from BindingDB
Found 1 hit for monomerid = 97598
TargetAcetyl-CoA carboxylase 2 [151-2458](Homo sapiens (Human))
Sanofi
US Patent
LigandPNGBDBM97598(US8470841, 10)
Affinity DataIC50:  150nMpH: 7.5 T: 2°C. Assay description: the enzymatic activity of ACC and its inhibition by test substances were determined by a luminometric assay.
In DepthDetails US Patent