BDBM98268 US8481733, 80
SMILES Nc1nccn2c(nc(-c3ccc(Oc4c(F)cccc4F)cc3)c12)C1CCC1
InChI Key InChIKey=RVTRYDNHALOCGA-UHFFFAOYSA-N
Data  1 IC50
  Tab Delimited (TSV)   2D SDfile   Computed 3D by Vconf -m prep SDfile
Find this compound or compounds like it in BindingDB:
Activity Spreadsheet -- Enzyme Inhibition Constant Data from BindingDB
Found 1 hit for monomerid = 98268
TargetActivated CDC42 kinase 1(Homo sapiens (Human))
Osi Pharmaceuticals
US Patent
LigandPNGBDBM98268(US8481733, 80)
Affinity DataIC50:  320nM. Assay description: AlphaScreen (amplified luminescent proximity homogeneous assay) assay was used to test for ACK1 inhibitory activity.
In DepthDetails US Patent