Target
Enoyl-[acyl-carrier-protein] reductase [NADPH] FabI
Ligand
BDBM8726
Substrate
BDBM8737
Meas. Tech.
Enzyme Inhibition Assay
pH
6.5±n/a
Temperature
303.15±n/a K
IC50
1100±20 nM
Citation
 Heerding, DAChan, GDeWolf, WEFosberry, APJanson, CAJaworski, DDMcManus, EMiller, WHMoore, TDPayne, DJQiu, XRittenhouse, SFSlater-Radosti, CSmith, WTakata, DTVaidya, KSYuan, CCHuffman, WF 1,4-Disubstituted imidazoles are potential antibacterial agents functioning as inhibitors of enoyl acyl carrier protein reductase (FabI). Bioorg Med Chem Lett 11:2061-5 (2001)  
Target
Name:
Enoyl-[acyl-carrier-protein] reductase [NADPH] FabI
Synonyms:
Enoyl-ACP Reductase (FabI) FABI_STAAR fabI | trans-2-enoyl-[acyl carrier protein] reductase
Type:
Enzyme
Mol. Mass.:
27989.00
Organism:
Staphylococcus aureus
Description:
Q6GI75
Residue:
256
  
Inhibitor
Name:
BDBM8726
Synonyms:
5-chloro-2-(2,4-dichlorophenoxy)phenol TCL US20230414581, Compound 35
Type:
Small organic molecule
Emp. Form.:
C12H7Cl3O2
Mol. Mass.:
289.542
SMILES:
Oc1cc(Cl)ccc1Oc1ccc(Cl)cc1Cl
:
Substrate
Name:
BDBM8737
Synonyms:
2-Butenoyl-CoA Crotonoyl-CoA {[(2R,3S,4R,5R)-5-(6-amino-9H-purin-9-yl)-2-{[({[(3-{[2-({2-[(2E)-but-2-enoylsulfanyl]ethyl}carbamoyl)ethyl]carbamoyl}-3-hydroxy-2,2-dimethylpropoxy)(hydroxy)phosphoryl]oxy}(hydroxy)phosphoryl)oxy]methyl}-4-hydroxyoxolan-3-yl]oxy}phosphonic acid
Type:
Small organic molecule
Emp. Form.:
C25H40N7O17P3S
Mol. Mass.:
835.608
SMILES:
C\C=C\C(=O)SCCNC(=O)CCNC(=O)C(O)C(C)(C)COP(O)(=O)OP(O)(=O)OC[C@H]1O[C@H]([C@H](O)[C@@H]1OP(O)(O)=O)n1cnc2c(N)ncnc12
: