Target
Tyrosine-protein kinase Mer
Ligand
BDBM308201
Substrate
Meas. Tech.
Activity Assay
IC50
0.690±n/a nM
Citation
 Wang, XZhang, WFrye, S Therapeutic uses of selected pyrimidine compounds with anti-Mer tyrosine kinase activity US Patent  US9649309 Publication Date 5/16/2017 
Target
Name:
Tyrosine-protein kinase Mer
Synonyms:
MER MERTK Proto-oncogene c-Mer Receptor tyrosine kinase MerTK | Tyrosine-protein kinase Mer
Type:
PROTEIN
Mol. Mass.:
110234.77
Organism:
Homo sapiens (Human)
Description:
ChEMBL_1498723
Residue:
999
  
Inhibitor
Name:
BDBM308201
Synonyms:
US9649309, Compound UNC2606A
Type:
Small organic molecule
Emp. Form.:
C26H39N7O2
Mol. Mass.:
481.6336
SMILES:
CCCCNc1ncc(c(NC2CC[C@H](O)CC2)n1)-c1ccc(cn1)C(=O)NC1CCN(C)CC1
: