Target
Tyrosine-protein kinase Mer
Ligand
BDBM308227
Substrate
Meas. Tech.
Activity Assay
IC50
1.000±n/a nM
Citation
 Wang, XZhang, WFrye, S Therapeutic uses of selected pyrimidine compounds with anti-Mer tyrosine kinase activity US Patent  US9649309 Publication Date 5/16/2017 
Target
Name:
Tyrosine-protein kinase Mer
Synonyms:
MER MERTK Proto-oncogene c-Mer Receptor tyrosine kinase MerTK | Tyrosine-protein kinase Mer
Type:
PROTEIN
Mol. Mass.:
110234.77
Organism:
Homo sapiens (Human)
Description:
ChEMBL_1498723
Residue:
999
  
Inhibitor
Name:
BDBM308227
Synonyms:
US9649309, Compound UNC4104A
Type:
Small organic molecule
Emp. Form.:
C26H41N7O
Mol. Mass.:
467.65
SMILES:
CCCCNc1ncc(c(NC2CCC(O)CC2)n1)-c1ccc(CN2CC[C@H](C2)N(C)C)cn1
: