Target
Alpha-1,3-mannosyl-glycoprotein 2-beta-N-acetylglucosaminyltransferase
Ligand
BDBM309222
Substrate
Meas. Tech.
Radioligand Binding Assay
Ki
<10.00±n/a nM
Citation
 Amberg, WPohlki, FLange, UWang, YXZhao, HHLi, HBrewer, JTZanze, IDietrich, JVasudevan, ADjuric, SWLao, YHutchins, CW Pyrrolidine derivatives, pharmaceutical compositions containing them, and their use in therapy US Patent  US9656955 Publication Date 5/23/2017 
Target
Name:
Alpha-1,3-mannosyl-glycoprotein 2-beta-N-acetylglucosaminyltransferase
Synonyms:
GGNT1 GLYT1 GlcNAc-T I MGAT1 N-glycosyl-oligosaccharide-glycoprotein N-acetylglucosaminyltransferase I
Type:
PROTEIN
Mol. Mass.:
50891.32
Organism:
Homo sapiens (Human)
Description:
ChEMBL_107587
Residue:
445
  
Inhibitor
Name:
BDBM309222
Synonyms:
(3R,4S)-4-(4-fluorophenyl)-N-[4-fluoro-3-(pyridin-3-yl)phenyl]-1-[(1-methyl-1H-imidazol-4-yl)sulfonyl]pyrrolidin-3-amine | US9656955, Example 745
Type:
Small Organic Molecule
Emp. Form.:
C25H23F2N5O2S
Mol. Mass.:
495.544
SMILES:
Cn1cnc(c1)S(=O)(=O)N1C[C@H](Nc2ccc(F)c(c2)-c2cccnc2)[C@H](C1)c1ccc(F)cc1
: