Target
Alpha-1,3-mannosyl-glycoprotein 2-beta-N-acetylglucosaminyltransferase
Ligand
BDBM309293
Substrate
Meas. Tech.
Radioligand Binding Assay
Ki
<10.00±n/a nM
Citation
 Amberg, WPohlki, FLange, UWang, YXZhao, HHLi, HBrewer, JTZanze, IDietrich, JVasudevan, ADjuric, SWLao, YHutchins, CW Pyrrolidine derivatives, pharmaceutical compositions containing them, and their use in therapy US Patent  US9656955 Publication Date 5/23/2017 
Target
Name:
Alpha-1,3-mannosyl-glycoprotein 2-beta-N-acetylglucosaminyltransferase
Synonyms:
GGNT1 GLYT1 GlcNAc-T I MGAT1 N-glycosyl-oligosaccharide-glycoprotein N-acetylglucosaminyltransferase I
Type:
PROTEIN
Mol. Mass.:
50891.32
Organism:
Homo sapiens (Human)
Description:
ChEMBL_107587
Residue:
445
  
Inhibitor
Name:
BDBM309293
Synonyms:
Trans-N-[2-chloro-4-(trifluoromethyl)benzyl]-4-(3-fluoropyridin-2-yl)-1-[(1-methyl-1H-1,2,3-triazol-4-yl)sulfonyl]pyrrolidin-3-amine | US9656955, Example 818
Type:
Small Organic Molecule
Emp. Form.:
C20H19ClF4N6O2S
Mol. Mass.:
518.915
SMILES:
Cn1cc(nn1)S(=O)(=O)N1C[C@@H](NCc2ccc(cc2Cl)C(F)(F)F)[C@@H](C1)c1ncccc1F
: