Target
Bromodomain-containing protein 2 [364-436]
Ligand
BDBM50092310
Substrate
Meas. Tech.
Biolayer Interferometry (BLI) Binding Assay
pH
7.4±n/a
Kd
13±2.10 nM
Comments
extracted
Citation
 Wang, SRan, XZhao, YYang, CLiu, LBai, LMcEachern, DStuckey, JMeagher, JLSun, DLi, XZhou, BKaratas, HLuo, RChinnaiyan, AAsangani, IA BET bromodomain inhibitors and therapeutic methods using the same US Patent  US9675697 Publication Date 6/13/2017 
Target
Name:
Bromodomain-containing protein 2 [364-436]
Synonyms:
BRD2 Bromodomain-containing protein 2 (BRD2)(BD2) KIAA9001 | RING3
Type:
Protein
Mol. Mass.:
8615.14
Organism:
Homo sapiens (Human)
Description:
BD2 (364-436 aa) of P25440
Residue:
73
  
Inhibitor
Name:
BDBM50092310
Synonyms:
CHEMBL3581661 | US9675697, Cpd. No. 23
Type:
Small organic molecule
Emp. Form.:
C24H23N5O2
Mol. Mass.:
413.4717
SMILES:
COc1cc2c(cc1-c1c(C)noc1C)[nH]c1ccnc(-c3c(C)[nH]nc3C3CC3)c21
: