Target
Fatty acid-binding protein, adipocyte
Ligand
BDBM312340
Substrate
Meas. Tech.
Time Resolved-Fluorescence Energy Transfer (TR-FRET) Assay
IC50
10.00±n/a nM
Citation
 Buettelmann, BCeccarelli, SMKuehne, HKuhn, BNeidhart, WObst Sander, URichter, H Bicyclic thiophenylamide compounds US Patent  US9604977 Publication Date 3/28/2017 
Target
Name:
Fatty acid-binding protein, adipocyte
Synonyms:
A-FABP ALBP FABP4 Fatty acid binding protein adipocyte Fatty acid-binding protein 4 (FABP4)
Type:
Enzyme
Mol. Mass.:
14719.23
Organism:
Homo sapiens (Human)
Description:
P15090
Residue:
132
  
Inhibitor
Name:
BDBM312340
Synonyms:
2-[3-(4-Trifluoromethyl-thiazol-2-yl)-4,5,6,7-tetrahydro-benzo[b]thiophen-2-ylcarbamoyl]-cyclohex-1-enecarboxylic acid | US9604977, Example 86
Type:
Small organic molecule
Emp. Form.:
C20H19F3N2O3S2
Mol. Mass.:
456.502
SMILES:
OC(=O)C1=C(CCCC1)C(=O)Nc1sc2CCCCc2c1-c1nc(cs1)C(F)(F)F
: