Target
Caspase-7
Ligand
BDBM10320
Substrate
Caspase Fluorogenic Substrate
Meas. Tech.
Caspase Inhibition Assay
IC50
310±n/a nM
Citation
 Chu, WZhang, JZeng, CRothfuss, JTu, ZChu, YReichert, DEWelch, MJMach, RH N-benzylisatin sulfonamide analogues as potent caspase-3 inhibitors: synthesis, in vitro activity, and molecular modeling studies. J Med Chem 48:7637-47 (2005)  
Target
Name:
Caspase-7
Synonyms:
Apoptotic protease Mch-3 CASP7 CMH-1 MCH3 | caspase 7, apoptosis-related cysteine peptidase
Type:
Enzyme
Mol. Mass.:
34273.91
Organism:
Homo sapiens (Human)
Description:
P55210
Residue:
303
  
Inhibitor
Name:
BDBM10320
Synonyms:
(S)-1-Methyl-5-{1-[2-(phenoxymethyl)pyrrolidinyl]sulfonyl}isatin CHEMBL293034 Isatin Sulfonamide 31 | Pyrrolidine Isatin Analogue 11a
Type:
Small organic molecule
Emp. Form.:
C20H20N2O5S
Mol. Mass.:
400.448
SMILES:
CN1C(=O)C(=O)c2cc(ccc12)S(=O)(=O)N1CCC[C@H]1COc1ccccc1
:
Substrate
Name:
Caspase Fluorogenic Substrate
Synonyms:
Ac-DEVD-AMC | Caspase Fluorogenic Substrate
Type:
Peptide
Mol. Mass.:
1461.77
Organism:
Description:
AMC=7-Amino-4-methylcoumarin
Residue:
16
ACASPGLVALASPAMC