Target
Caspase-6
Ligand
BDBM10320
Substrate
Caspase-6 Fluorogenic Substrate
Meas. Tech.
Caspase Inhibition Assay
IC50
>5000±n/a nM
Citation
 Chu, WZhang, JZeng, CRothfuss, JTu, ZChu, YReichert, DEWelch, MJMach, RH N-benzylisatin sulfonamide analogues as potent caspase-3 inhibitors: synthesis, in vitro activity, and molecular modeling studies. J Med Chem 48:7637-47 (2005)  
Target
Name:
Caspase-6
Synonyms:
Apoptotic protease Mch-2 CASP6 Caspase | MCH2
Type:
Enzyme
Mol. Mass.:
33312.62
Organism:
Homo sapiens (Human)
Description:
P55212
Residue:
293
  
Inhibitor
Name:
BDBM10320
Synonyms:
(S)-1-Methyl-5-{1-[2-(phenoxymethyl)pyrrolidinyl]sulfonyl}isatin CHEMBL293034 Isatin Sulfonamide 31 | Pyrrolidine Isatin Analogue 11a
Type:
Small organic molecule
Emp. Form.:
C20H20N2O5S
Mol. Mass.:
400.448
SMILES:
CN1C(=O)C(=O)c2cc(ccc12)S(=O)(=O)N1CCC[C@H]1COc1ccccc1
:
Substrate
Name:
Caspase-6 Fluorogenic Substrate
Synonyms:
Ac-VEID-AMC
Type:
Mol. Mass.:
1560.92
Organism:
Description:
AMC=7-Amino-4-methylcoumarin
Residue:
16
ACVALGLILEASPAMC