Target
Aldo-keto reductase family 1 member C3
Ligand
BDBM313812
Substrate
Meas. Tech.
AKR1C3-Inhibitory Activity Assay
IC50
1.20±n/a nM
Citation
 Koppitz, MSiebeneicher, HSteuber, HTer Laak, ANubbemeyer, RRottmann, AIrlbacher, HBader, BPeters, MWagenfeld, ATerebesi, I [8-(phenylsulfonyl)-3,8-diazabicyclo[3.2.1]oct-3-yl](1H-1,2,3-triazol-4-yl)methanones US Patent  US10167293 Publication Date 1/1/2019 
Target
Name:
Aldo-keto reductase family 1 member C3
Synonyms:
17-beta-Hydroxysteroid Dehydrogenase 5 (17-beta-HSD5, AKR1C3) AK1C3_HUMAN Aldo-keto reductase family 1 member C3 Aldo-keto reductase family 1 member C3 (AK1C3a) Aldo-keto-reductase family 1 member C3 Dihydrodiol dehydrogenase 3 Estradiol 17-beta-dehydrogenase KIAA0119 Prostaglandin F synthase Trans-1,2-dihydrobenzene-1,2-diol dehydrogenase
Type:
Enzyme
Mol. Mass.:
36859.86
Organism:
Homo sapiens (Human)
Description:
P42330
Residue:
323
  
Inhibitor
Name:
BDBM313812
Synonyms:
US10167293, Example 5
Type:
Small organic molecule
Emp. Form.:
C15H16ClN5O3S
Mol. Mass.:
381.837
SMILES:
Clc1cccc(c1)S(=O)(=O)N1C2CCC1CN(C2)C(=O)c1cnn[nH]1
: