Target
Aldo-keto reductase family 1 member C3
Ligand
BDBM313847
Substrate
Meas. Tech.
AKR1C3-Inhibitory Activity Assay
IC50
1.30±n/a nM
Citation
 Koppitz, MSiebeneicher, HSteuber, HTer Laak, ANubbemeyer, RRottmann, AIrlbacher, HBader, BPeters, MWagenfeld, ATerebesi, I [8-(phenylsulfonyl)-3,8-diazabicyclo[3.2.1]oct-3-yl](1H-1,2,3-triazol-4-yl)methanones US Patent  US10167293 Publication Date 1/1/2019 
Target
Name:
Aldo-keto reductase family 1 member C3
Synonyms:
17-beta-Hydroxysteroid Dehydrogenase 5 (17-beta-HSD5, AKR1C3) AK1C3_HUMAN Aldo-keto reductase family 1 member C3 Aldo-keto reductase family 1 member C3 (AK1C3a) Aldo-keto-reductase family 1 member C3 Dihydrodiol dehydrogenase 3 Estradiol 17-beta-dehydrogenase KIAA0119 Prostaglandin F synthase Trans-1,2-dihydrobenzene-1,2-diol dehydrogenase
Type:
Enzyme
Mol. Mass.:
36859.86
Organism:
Homo sapiens (Human)
Description:
P42330
Residue:
323
  
Inhibitor
Name:
BDBM313847
Synonyms:
US10167293, Example 39
Type:
Small organic molecule
Emp. Form.:
C19H19N5O3S
Mol. Mass.:
397.451
SMILES:
O=C(N1CC2CCC(C1)N2S(=O)(=O)c1cccc2ccccc12)c1cnn[nH]1
: