Target
Aldehyde dehydrogenase, mitochondrial
Ligand
BDBM153696
Substrate
Meas. Tech.
ALDH2 Assay
IC50
25.0±n/a nM
Citation
 Cannizzaro, CEGraupe, MGuerrero, JALu, YStrickley, RGVenkataramani, CZablocki, J Compounds for the treatment of addiction US Patent  US9610299 Publication Date 4/4/2017 
Target
Name:
Aldehyde dehydrogenase, mitochondrial
Synonyms:
ALDH class 2 ALDH2 ALDHI Aldehyde dehydrogenase (ALDH2)
Type:
Enzyme
Mol. Mass.:
56382.67
Organism:
Homo sapiens (Human)
Description:
P05091
Residue:
517
  
Inhibitor
Name:
BDBM153696
Synonyms:
US10507215, Compound 13 US9610299, Example 13
Type:
Small organic molecule
Emp. Form.:
C19H13Cl2FN2O2
Mol. Mass.:
391.223
SMILES:
Fc1c[nH]c(=O)cc1-c1ccc(CNC(=O)c2c(Cl)cccc2Cl)cc1
: