Target
Endochitinase B1
Ligand
BDBM10854
Substrate
BDBM10848
Meas. Tech.
Enzyme Inhibition Assay
pH
5.5±n/a
Temperature
310.15±n/a K
IC50
500±n/a nM
Citation
 Rao, FVHouston, DRBoot, RGAerts, JMHodkinson, MAdams, DJShiomi, KOmura, Svan Aalten, DM Specificity and affinity of natural product cyclopentapeptide inhibitors against A. fumigatus, human, and bacterial chitinases. Chem Biol 12:65-76 (2005)  
Target
Name:
Endochitinase B1
Synonyms:
AfChiB1 Chitinase B1 chiB1
Type:
Enzyme
Mol. Mass.:
47612.97
Organism:
Aspergillus fumigatus
Description:
Q873X9
Residue:
433
  
Inhibitor
Name:
BDBM10854
Synonyms:
4-[(1S,4R,10S,13S,16S,18R)-10-{3-[(acetamidomethanimidoyl)amino]propyl}-18-hydroxy-16-(1H-imidazol-4-ylmethyl)-3,9,12,15,20-pentaoxo-2,8,11,14,17-pentaazatricyclo[15.2.1.0^{4,8}]icosan-13-yl]butanoic acid CHEMBL445236
Type:
Small organic molecule
Emp. Form.:
C29H42N10O9
Mol. Mass.:
674.7054
SMILES:
CC(=O)NC(=N)NCCC[C@@H]1NC(=O)[C@H](CCCC(O)=O)NC(=O)[C@H](Cc2cnc[nH]2)N2[C@H](O)C[C@H](NC(=O)[C@H]3CCCN3C1=O)C2=O
:
Substrate
Name:
BDBM10848
Synonyms:
4-methylumbelliferyl beta-D-N,N-diacetylchitobiose N-[(2S,3R,4R,5S,6R)-2-{[(2R,3S,4R,5R,6S)-5-acetamido-4-hydroxy-2-(hydroxymethyl)-6-[(4-methyl-2-oxo-2H-chromen-7-yl)oxy]oxan-3-yl]oxy}-4,5-dihydroxy-6-(hydroxymethyl)oxan-3-yl]acetamide | fluorogenic substrate
Type:
Small organic molecule
Emp. Form.:
C26H34N2O13
Mol. Mass.:
582.5538
SMILES:
CC(=O)N[C@@H]1[C@@H](O)[C@H](O)[C@@H](CO)O[C@H]1O[C@@H]1[C@@H](CO)O[C@@H](Oc2ccc3c(C)cc(=O)oc3c2)[C@H](NC(C)=O)[C@H]1O
: