Target
Chitinase B
Ligand
BDBM10853
Substrate
BDBM10848
Meas. Tech.
Enzyme Inhibition Assay
pH
5.5±n/a
Temperature
310.15±n/a K
Ki
33000±n/a nM
Citation
 Rao, FVHouston, DRBoot, RGAerts, JMHodkinson, MAdams, DJShiomi, KOmura, Svan Aalten, DM Specificity and affinity of natural product cyclopentapeptide inhibitors against A. fumigatus, human, and bacterial chitinases. Chem Biol 12:65-76 (2005)  
Target
Name:
Chitinase B
Synonyms:
CHIB_SERMA | chiB
Type:
Enzyme
Mol. Mass.:
55462.70
Organism:
Serratia marcescens
Description:
P11797
Residue:
499
  
Inhibitor
Name:
BDBM10853
Synonyms:
(2R,5S,8S,11S,15S)-8-benzyl-2,7-dimethyl-5-[3-({[(methylcarbamoyl)amino]methanimidoyl}amino)propyl]-3,6,9,13,17-pentaoxo-1,4,7,10,14-pentaazacycloheptadecane-11,15-dicarboxylic acid | Argifin
Type:
Small organic molecule
Emp. Form.:
C29H41N9O10
Mol. Mass.:
675.6901
SMILES:
CNC(=O)NC(=N)NCCC[C@@H]1NC(=O)[C@@H](C)NC(=O)C[C@H](NC(=O)C[C@H](NC(=O)[C@H](Cc2ccccc2)N(C)C1=O)C(O)=O)C(O)=O
:
Substrate
Name:
BDBM10848
Synonyms:
4-methylumbelliferyl beta-D-N,N-diacetylchitobiose N-[(2S,3R,4R,5S,6R)-2-{[(2R,3S,4R,5R,6S)-5-acetamido-4-hydroxy-2-(hydroxymethyl)-6-[(4-methyl-2-oxo-2H-chromen-7-yl)oxy]oxan-3-yl]oxy}-4,5-dihydroxy-6-(hydroxymethyl)oxan-3-yl]acetamide | fluorogenic substrate
Type:
Small organic molecule
Emp. Form.:
C26H34N2O13
Mol. Mass.:
582.5538
SMILES:
CC(=O)N[C@@H]1[C@@H](O)[C@H](O)[C@@H](CO)O[C@H]1O[C@@H]1[C@@H](CO)O[C@@H](Oc2ccc3c(C)cc(=O)oc3c2)[C@H](NC(C)=O)[C@H]1O
: