Target
Amine oxidase [flavin-containing] B
Ligand
BDBM11018
Substrate
BDBM11019
Meas. Tech.
MAO Inhibition Assay
pH
7.4±n/a
Temperature
298.15±n/a K
Ki
>1000000±n/a nM
Comments
no inhibition
Citation
 Hubalek, FBinda, CKhalil, ALi, MMattevi, ACastagnoli, NEdmondson, DE Demonstration of isoleucine 199 as a structural determinant for the selective inhibition of human monoamine oxidase B by specific reversible inhibitors. J Biol Chem 280:15761-6 (2005)  
Target
Name:
Amine oxidase [flavin-containing] B
Synonyms:
AOFB_BOVIN MAO-B Monoamine Oxidase Type B (MAO-B) Monoamine oxidase B | Monoamine oxidase type B
Type:
PROTEIN
Mol. Mass.:
58428.94
Organism:
Bos taurus
Description:
ChEMBL_1501478
Residue:
520
  
Inhibitor
Name:
BDBM11018
Synonyms:
2-[(E)-2-(3-chlorophenyl)ethenyl]-3,5,7-trimethyl-3H,4H,5H,6H,7H-imidazo[4,5-c]pyridine-4,6-dione | 8-(3-chlorostyryl)caffeine (CSC)
Type:
Small organic molecule
Emp. Form.:
C17H16ClN3O2
Mol. Mass.:
329.781
SMILES:
CC1c2nc(\C=C\c3cccc(Cl)c3)n(C)c2C(=O)N(C)C1=O
:
Substrate
Name:
BDBM11019
Synonyms:
1-methyl-4-(1-methyl-1H-pyrrol-2-yl)-1,2,3,6-tetrahydropyridine MMTP
Type:
Small organic molecule
Emp. Form.:
C11H16N2
Mol. Mass.:
176.2581
SMILES:
CN1CCC(=CC1)c1cccn1C
: