Target
Alpha-1A adrenergic receptor
Ligand
BDBM317585
Substrate
Meas. Tech.
In Vitro Assay
IC50
11.0±n/a nM
Citation
 Becker-Pelster, EMBuchgraber, PBuchmüller, AEngel, KGeiss, VGöller, AHimmel, HKast, RKnorr, ALang, DRedlich, GSchmeck, CTinel, HWunder, F Substituted piperidinyltetrahydroquinolines US Patent  US9624198 Publication Date 4/18/2017 
Target
Name:
Alpha-1A adrenergic receptor
Synonyms:
ADA1A_HUMAN ADRA1C Alpha 1A-adrenoceptor Alpha adrenergic receptor 1a Alpha-adrenergic receptor 1c adrenergic Alpha1 | adrenergic Alpha1C
Type:
Cell-surface receptors
Mol. Mass.:
51511.67
Organism:
Homo sapiens (Human)
Description:
P35348
Residue:
466
  
Inhibitor
Name:
BDBM317585
Synonyms:
US9624198, 10 | [4-(3,4-Dihydroisoquinolin-2(1H)-yl)piperidin-1-yl][6-(2-oxa-6-azaspiro[3.3]hept-6-yl)pyridin-3-yl]methanone
Type:
Small organic molecule
Emp. Form.:
C25H30N4O2
Mol. Mass.:
418.5313
SMILES:
O=C(N1CCC(CC1)N1CCc2ccccc2C1)c1ccc(nc1)N1CC2(COC2)C1
: