Target
Cytochrome b-245 heavy chain
Ligand
BDBM318938
Substrate
Meas. Tech.
Nox2 Assay
IC50
59000±n/a nM
Citation
 Wikström, PWalum, EWilcke, M N2-(3,4-dimethylphenyl)-6-((4-(p-tolyl)piperazin-1-yl)methyl)-1,3,5-triazine-2,4-diamine US Patent  US10173988 Publication Date 1/8/2019 
Target
Name:
Cytochrome b-245 heavy chain
Synonyms:
CGD91-phox CYBB Cytochrome b-245, beta polypeptide [Homo sapiens] Heme-binding membrane glycoprotein gp91phox NADPH oxidase 2 (NOX2) Neutrophil cytochrome b 91 kDa polypeptide gp91-1 p22 phagocyte B-cytochrome
Type:
Enzyme
Mol. Mass.:
65355.82
Organism:
Homo sapiens (Human)
Description:
P04839
Residue:
570
  
Inhibitor
Name:
BDBM318938
Synonyms:
US10173988, Compound C
Type:
Small organic molecule
Emp. Form.:
C23H29N7
Mol. Mass.:
403.5233
SMILES:
Cc1cccc(c1)N1CCN(Cc2nc(N)nc(Nc3ccc(C)c(C)c3)n2)CC1
: