Target
5-hydroxytryptamine receptor 1A
Ligand
BDBM319709
Substrate
Meas. Tech.
5-HT1A Receptor Agonism Activity Test
EC50
0.235±n/a nM
Citation
 Jiang, HWang, ZLi, JZhang, RHe, YLiu, YBi, MLiu, ZTian, GChen, WYang, FWu, CWang, YJiang, XYin, JWang, GShen, J Heterocyclic compounds, process for preparation of the same and use thereof US Patent  US10174011 Publication Date 1/8/2019 
Target
Name:
5-hydroxytryptamine receptor 1A
Synonyms:
5-HT-1A 5-hydroxytryptamine receptor 1A (5-HT-1A) ADRB2RL1 Dopamine D2 receptor and serotonin 1a receptor HTR1A | Serotonin receptor 1A
Type:
Mol. Mass.:
46122.49
Organism:
Homo sapiens (Human)
Description:
Residue:
422
  
Inhibitor
Name:
BDBM319709
Synonyms:
5-(2-(4-(6-fluorobenzo[b]thiophen-4-yl)piperazin-1-yl)ethyl)indolin-2-one | US10174011, Example 84
Type:
Small organic molecule
Emp. Form.:
C22H22FN3OS
Mol. Mass.:
395.493
SMILES:
Fc1cc(N2CCN(CCc3ccc4NC(=O)Cc4c3)CC2)c2ccsc2c1
: