Target
Replicase polyprotein 1ab
Ligand
BDBM11230
Substrate
Substrate Peptide
Meas. Tech.
3CL Protease Enzyme Assays
pH
7.5±n/a
Temperature
298.15±n/a K
Ki
2260±n/a nM
Citation
 Yang, SChen, SJHsu, MFWu, JDTseng, CTLiu, YFChen, HCKuo, CWWu, CSChang, LWChen, WCLiao, SYChang, TYHung, HHShr, HLLiu, CYHuang, YAChang, LYHsu, JCPeters, CJWang, AHHsu, MC Synthesis, crystal structure, structure-activity relationships, and antiviral activity of a potent SARS coronavirus 3CL protease inhibitor. J Med Chem 49:4971-80 (2006)  
Target
Name:
Replicase polyprotein 1ab
Synonyms:
3C-like proteinase 3C-like proteinase (SARS-CoV 3Cpro) 3CLp GFL Guanine-N7 methyltransferase Helicase Leader protein Non-structural protein 10 Non-structural protein 3 Non-structural protein 6 Non-structural protein 8 ORF1ab polyprotein PL2-PRO Pol R1AB_SARS RdRp SARS coronavirus main proteinase nsp1 nsp12 nsp14 nsp16 nsp3 nsp5 nsp7 nsp9 pp1ab | rep
Type:
Protein
Mol. Mass.:
790250.81
Organism:
Human SARS coronavirus (SARS-CoV) (Severe acute respiratory syndrome coronavirus)
Description:
P0C6X7
Residue:
7073
  
Inhibitor
Name:
BDBM11230
Synonyms:
AG7088 analogue 2d N-[(benzyloxy)carbonyl]-L-valyl-N-((1S,2E)-4-ethoxy-4-oxo-1-{[(3S)-2-oxopyrrolidin-3-yl]methyl}but-2-enyl)-L-phenylalaninamide acs.jmedchem.1c00409_ST.305 ethyl (2E,4S)-4-[(2S)-2-[(2S)-2-{[(benzyloxy)carbonyl]amino}-3-methylbutanamido]-3-phenylpropanamido]-5-[(3S)-2-oxopyrrolidin-3-yl]pent-2-enoate
Type:
Small organic molecule
Emp. Form.:
C33H42N4O7
Mol. Mass.:
606.7092
SMILES:
CCOC(=O)\C=C\[C@H](C[C@@H]1CCNC1=O)NC(=O)[C@H](Cc1ccccc1)NC(=O)[C@@H](NC(=O)OCc1ccccc1)C(C)C
:
Substrate
Name:
Substrate Peptide
Synonyms:
Type:
Peptide
Mol. Mass.:
1597.88
Organism:
Description:
Residue:
15
SITSAVLQSGFRKMA